NetXMS Support Forum

Please login or register.

Login with username, password and session length

Author Topic: V2.1-M2 build problem  (Read 396 times)

gmonk63

  • Full Member
  • ***
  • Posts: 109
    • View Profile
V2.1-M2 build problem
« on: February 07, 2017, 12:10:07 am »

getting the following when trying to install..  this is on a Ubuntu 16.04 system installing from source 


/usr/local/bin/nxmibc: symbol lookup error: /usr/local/lib/libnxsnmp.so.2: undefined symbol: wfopen
Makefile:1204: recipe for target 'install-data-hook' failed
make[5]: *** [install-data-hook] Error 127
make[5]: Leaving directory '/home/nmsadmin/netxms-2.1-M2/contrib/mibs'
Makefile:1139: recipe for target 'install-data-am' failed
make[4]: *** [install-data-am] Error 2
make[4]: Leaving directory '/home/nmsadmin/netxms-2.1-M2/contrib/mibs'
Makefile:1094: recipe for target 'install-am' failed
make[3]: *** [install-am] Error 2
make[3]: Leaving directory '/home/nmsadmin/netxms-2.1-M2/contrib/mibs'
Makefile:431: recipe for target 'install-recursive' failed
make[2]: *** [install-recursive] Error 1
make[2]: Leaving directory '/home/nmsadmin/netxms-2.1-M2/contrib'
Makefile:481: recipe for target 'install-recursive' failed
make[1]: *** [install-recursive] Error 1
make[1]: Leaving directory '/home/nmsadmin/netxms-2.1-M2'
Makefile:775: recipe for target 'install' failed
make: *** [install] Error 2
Logged

gmonk63

  • Full Member
  • ***
  • Posts: 109
    • View Profile
Re: V2.1-M2 build problem
« Reply #1 on: February 07, 2017, 12:35:15 am »

Never mind I got it fixed... I manually removed all nextms libs in my /usr/local/lib  and ran make install again and it worked not sure what happend  :o
Logged